Skip to content

feat(files): integrate Project files with the browser and Mothership #35912

feat(files): integrate Project files with the browser and Mothership

feat(files): integrate Project files with the browser and Mothership #35912

Triggered via pull request October 13, 2026 07:54
Status Failure
Total duration 11m 10s
Artifacts 9

ci.yml

on: pull_request
version
version
desktop-changes
desktop-changes
trigger-upload
trigger-upload
Matrix: image-amd64
Matrix: image-arm64
Matrix: image-dev
docs-changes
docs-changes
migrate-dev  /  migrate
migrate-dev / migrate
Matrix: checks / e2e
Matrix: checks / integration
Matrix: checks / test
desktop-signing
0s
desktop-signing
Matrix: checks / e2e-mobile
prerelease-create
0s
prerelease-create
prerelease-build  /  build
prerelease-build / build
migrate  /  migrate
migrate / migrate
prerelease-publish
0s
prerelease-publish
promote
promote
prerelease-prune
0s
prerelease-prune
Matrix: ghcr
docs  /  embeddings
docs / embeddings
trigger-promote
trigger-promote
attest-subjects
0s
attest-subjects
Matrix: attest
release
0s
release
desktop-release  /  build
desktop-release / build
Fit to window
Zoom out
Zoom in

Annotations

13 errors, 49 warnings, and 1 notice
checks / test (1/2)
Process completed with exit code 1.
scripts/check-project-rollout.test.ts > Project column rollout release acknowledgement > rejects a newer deployment discovered i…: scripts/check-project-rollout.test.ts#L107
AssertionError: expected 2 to be 1 // Object.is equality - Expected + Received - 1 + 2 ❯ scripts/check-project-rollout.test.ts:107:46
scripts/check-project-rollout.test.ts > Project column rollout release acknowledgement > rejects a newer pending release even wh…: scripts/check-project-rollout.test.ts#L107
AssertionError: expected 2 to be 1 // Object.is equality - Expected + Received - 1 + 2 ❯ scripts/check-project-rollout.test.ts:107:46
scripts/check-project-rollout.test.ts > Project column rollout release acknowledgement > rejects a stale acknowledgement after a…: scripts/check-project-rollout.test.ts#L107
AssertionError: expected 2 to be 1 // Object.is equality - Expected + Received - 1 + 2 ❯ scripts/check-project-rollout.test.ts:107:46
scripts/check-project-rollout.test.ts > Project column rollout release acknowledgement > accepts the latest completed acknowledg…: scripts/check-project-rollout.test.ts#L100
AssertionError: python3: can't open file '/home/runner/_work/sim/sim/.github/scripts/check-project-rollout.py': [Errno 2] No such file or directory : expected 2 to be +0 // Object.is equality - Expected + Received - 0 + 2 ❯ scripts/check-project-rollout.test.ts:100:46
checks / lint
Process completed with exit code 1.
check:test-patterns
audit failed — see the group above
checks / lint
Process completed with exit code 1.
checks / test-types
Process completed with exit code 1.
checks / integration (push, 3/4)
Process completed with exit code 1.
checks / integration (migrate, 3/4)
Process completed with exit code 1.
checks / ci
Process completed with exit code 1.
checks / ci
Checks did not pass:
checks / test (1/2)
[git-mirror] Skipping cache commit: Found 2 failed/cancelled steps
checks / test (1/2)
[git-mirror] - Step: unknown (failed)
checks / test (1/2)
Skipping sticky disk commit due to previous step failures
checks / test (1/2)
- Step: unknown (failed)
checks / test (1/2)
Found 2 failed/cancelled steps in previous workflow steps
checks / test (1/2)
Skipping sticky disk commit due to previous step failures
checks / test (1/2)
- Step: unknown (failed)
checks / test (1/2)
Found 2 failed/cancelled steps in previous workflow steps
checks / test (1/2)
Skipping sticky disk commit due to previous step failures
checks / test (1/2)
- Step: unknown (failed)
checks / test (1/2)
Found 2 failed/cancelled steps in previous workflow steps
checks / lint
[git-mirror] Skipping cache commit: Found 2 failed/cancelled steps
checks / lint
[git-mirror] - Step: unknown (failed)
checks / lint
Skipping sticky disk commit due to previous step failures
checks / lint
- Step: unknown (failed)
checks / lint
Found 2 failed/cancelled steps in previous workflow steps
checks / lint
Skipping sticky disk commit due to previous step failures
checks / lint
- Step: unknown (failed)
checks / lint
Found 2 failed/cancelled steps in previous workflow steps
checks / lint
Skipping sticky disk commit due to previous step failures
checks / lint
- Step: unknown (failed)
checks / lint
Found 2 failed/cancelled steps in previous workflow steps
checks / test-types
[git-mirror] Skipping cache commit: Found 2 failed/cancelled steps
checks / test-types
[git-mirror] - Step: unknown (failed)
checks / test-types
Skipping sticky disk commit due to previous step failures
checks / test-types
- Step: unknown (failed)
checks / test-types
Found 2 failed/cancelled steps in previous workflow steps
checks / test-types
Skipping sticky disk commit due to previous step failures
checks / test-types
- Step: unknown (failed)
checks / test-types
Found 2 failed/cancelled steps in previous workflow steps
checks / integration (push, 3/4)
[git-mirror] Skipping cache commit: Found 2 failed/cancelled steps
checks / integration (push, 3/4)
[git-mirror] - Step: unknown (failed)
checks / integration (push, 3/4)
Skipping sticky disk commit due to previous step failures
checks / integration (push, 3/4)
- Step: unknown (failed)
checks / integration (push, 3/4)
Found 2 failed/cancelled steps in previous workflow steps
checks / integration (push, 3/4)
Skipping sticky disk commit due to previous step failures
checks / integration (push, 3/4)
- Step: unknown (failed)
checks / integration (push, 3/4)
Found 2 failed/cancelled steps in previous workflow steps
checks / integration (migrate, 3/4)
[git-mirror] Skipping cache commit: Found 2 failed/cancelled steps
checks / integration (migrate, 3/4)
[git-mirror] - Step: unknown (failed)
checks / integration (migrate, 3/4)
Skipping sticky disk commit due to previous step failures
checks / integration (migrate, 3/4)
- Step: unknown (failed)
checks / integration (migrate, 3/4)
Found 2 failed/cancelled steps in previous workflow steps
checks / integration (migrate, 3/4)
Skipping sticky disk commit due to previous step failures
checks / integration (migrate, 3/4)
- Step: unknown (failed)
checks / integration (migrate, 3/4)
Found 2 failed/cancelled steps in previous workflow steps
Slow Test: apps/desktop/e2e/desktop-tools-live-sim.spec.ts#L0
apps/desktop/e2e/desktop-tools-live-sim.spec.ts took 6.8m
checks / ci
[git-mirror] Skipping cache commit: Found 2 failed/cancelled steps
checks / ci
[git-mirror] - Step: unknown (failed)
🎭 Playwright Run Summary
12 passed (7.8m)

Artifacts

Produced during runtime
Name Size Digest
integration-reports-migrate-1
30 KB
sha256:8a1e0e6c275b63819fcddc8b5c3438b05f7a0eddfa676a40b24af4d81fb4eaeb
integration-reports-migrate-2
36.1 KB
sha256:5b5eba36b7f8c5f5d33b0f5246a69c85d98ef3d726a125406a25dc4439162aa5
integration-reports-migrate-3
48.5 KB
sha256:7d8200ccba1e45a30c89bb8d645246859b687f7b82922d19a05c8e9d1d4e6648
integration-reports-migrate-4
34.7 KB
sha256:9d30584b6744a6b7e7d5faa5b8aa58db3dae1f4058a6dfd8eb0f34958e4a71c2
integration-reports-push-1
31.4 KB
sha256:307221ec8e3f532d2d0d07a0d0775bf73c7bd53e7d57b52c4ab9a085c5558f17
integration-reports-push-2
36 KB
sha256:9ef7230621a27743daae0ccbdee735840e246c7adaa1db53ee316ed06b48eeba
integration-reports-push-3
48.4 KB
sha256:50ec6d5ca0288a260f85784b60d3cfc26fa2e6848a2e46acb28f42a0d8a1515e
integration-reports-push-4
34.7 KB
sha256:4c0dc35f50beadabbe4f8b57400bb741f9c7f0eb5c875e23719f38a1f21da59c
test-types
110 KB
sha256:26a586a984449712635835fee6771e67e8189994d19907c7317ee6153091b22b